{"text_format":"1","workbook":"xlsx","n_sheets":3,"sheets":["Selection future payment","Datenbasis1","Hilfsvariablen"],"not_rendered":{"charts":0,"images":1,"macros":1,"external_links":0,"defined_names":63,"comments":0,"pivot_tables":0},"unopened":[],"bounds":{"document_bytes":16777216,"sheet_cells":100000,"rows_first":2000,"rows_last":500,"rows_between":2000,"halvings":0,"cell_chars":16384,"cell_head_chars":4096},"cells_cut":0,"cells_raw":0,"read":"whole","date_system":"1900"}

{"sheet":"Selection future payment","index":0,"n_rows":40,"n_cols":4,"rows_kept":40,"cut":false,"hidden":false,"merged":[[17,0,17,1],[18,0,18,1],[32,0,32,1],[18,3,39,3],[36,0,36,1],[39,0,39,1],[38,0,38,1],[35,0,35,1],[31,0,31,1],[19,0,19,1],[20,0,20,1],[33,0,33,1]]}
["Tariff-based future payment"]
[]
["Company",null,null,"<--- Select a company to start"]
["Entry date before 04 January 2022","yes"]
["Employee group","tariff-employee"]
["Pay scale group","E01"]
["Pay scale category","-"]
["Pay scale level","-"]
["Federal State","Bavaria"]
["Employment level on 03 January 2022 ( = actual working hours) ",1]
["Regular weekly working days 2022",5]
["Type of contract ","permanent contract"]
["Parental leave, sickness, partial retirement, leave of absence \n(compensatory time account) in 1/2022?","no"]
["No entitlement to remuneration on 03 January 2022 \n(e.g. parental leave, long-term sickness, …)","no"]
["Partial retirement on 03 January 2022","no"]
["Paid leave of absence (compensatory time account)  > 1 year 1/2022","no"]
[]
["Result for tariff-based future payment 2022",null,null,"Hints for usage"]
[{"$f":"Hilfsvariablen!B16","v":"Please select a company and then fill out the form from top to bottom!"},null,null,"- To simplify editing, a macro is necessary, click in the dialog <activate macros> or click in the yellow menu bar <activate content>\n\n- The form is to be filled out from top to bottom, because some choices depend on each other\n\n- If you change an entry afterwards, all the following selection options must be checked again for valid values"]
[]
["There are various possible intended uses available to you.\nHere you can test how the choice of uses affects your tariff-based future payment:"]
["Possible intended uses","-"]
["PlusCard tariff","select"]
["Would you like to insure family members as well?","no"]
["PlusCard tariff for family members","comfort"]
["Age of spouse","-"]
["Age of child 1","-"]
["Age of child 2","-"]
["Age of child 3","-"]
["Number of requested days off","1 day in lieu"]
{"$rows_left_out":11}
{"sheet":"Datenbasis1","index":1,"n_rows":501,"n_cols":48,"rows_kept":501,"cut":false,"hidden":true,"merged":[]}
["Gesellschaften","PassenderTarifvertrag",null,"Mitarbeitergruppe",null,"Tarifgruppe",null,null,null,null,null,"Tariftyp",null,null,null,null,"Bundesland",null,"Beschäftigungsverhältnis",null,"Ja/Nein",null,"ATZ",null,"Wochenarbeitstage",null,"Verwendungsmöglichkeiten",null,"PlusCard Tarife",null,null,"PlusCard Tarife Familienangehörige",null,null,null,"Alter Familienangehörige",null,null,null,null,"PlusCard Tariftabelle Familienangehörige",null,null,null,null,null,"Anzahl Freistellungstage"]
["Fresenius SE & Co. KGaA","yes",null,"tariff-employee",null,"E01","-",null,null,null,null,"E01","-",null,null,null,"Bavaria",null,"permanent contract",null,"yes",null,"no",null,5,null,"Days in lieu & Compensatory time account",null,"select",12.67,null,"comfort","select",null,null,"Ehepartner","-","19 - 67 years","from 68 years",null,{"$f":"CONCATENATE(AP2,\"_\",AQ2,\"_\",AR2)","v":"Ehepartner_-_comfort"},"Ehepartner","-","comfort",0,null,"1 day in lieu",1]
["Fresenius Medical Care AG & Co. KGaA","yes",null,"non-tariff employee",null,"E02","-",null,null,null,null,"E02","-",null,null,null,"other federal state",null,"fixed-term contract",null,"no",null,"working period",null,4,null,"Days in lieu & PlusCard",null,"premium",16.48,null,"comfort","select","premium",null,"Kind","-","0 - 18 years","19 - 25 years",null,{"$f":"CONCATENATE(AP3,\"_\",AQ3,\"_\",AR3)","v":"Ehepartner_19 - 67 years_comfort"},"Ehepartner","19 - 67 years","comfort",6.38,null,"2 days in lieu",2]
["Fresenius Medical Care Deutschland GmbH","yes",null,"executives",null,"E03","-",null,null,null,null,"E03","-",null,null,null,null,null,null,null,null,null,"retirement period",null,3,null,"Compensatory time account",null,"prevent",70.010000000000005,null,"comfort","select","premium","prevent",null,null,null,null,null,"Ehepartner_from 68 years_comfort","Ehepartner","from 68 years","comfort",8.2899999999999991,null,"3 days in lieu",3]
["Fresenius Medical Care GmbH","yes",null,"apprentice",null,"E04","-",null,null,null,null,"E04","-",null,null,null,null,null,null,null,null,null,null,null,2,null,"Compensatory time account & PlusCard",null,null,null,null,null,null,null,null,null,null,null,null,null,"Kind_-_comfort","Kind","-","comfort",0]
["Fresenius Kabi AG","yes",null,"dual student",null,"E05","A, or 1","B, or 2","C, or 3",null,null,"E05","-",null,null,null,null,null,null,null,null,null,null,null,1,null,"PlusCard",null,null,null,null,null,null,null,null,null,null,null,null,null,"Kind_0 - 18 years_comfort","Kind","0 - 18 years","comfort",2.46]
["Fresenius Kabi Deutschland GmbH (not Mihla/Bad Hersfeld)","yes",null,"Mini-Job",null,"E06","A, or 1","B, or 2","C, or 3","D, or 4",null,"E06","-",null,null,null,null,null,null,null,null,null,null,null,4.99,null,"Days in lieu & Payment",null,null,null,null,null,null,null,null,null,null,null,null,null,"Kind_19 - 25 years_comfort","Kind","19 - 25 years","comfort",6.38]
["Fresenius Digital Technology GmbH","yes",null,"Midi-Job",null,"E07","A, or 1","B, or 2","C, or 3","D, or 4",null,"E07","-",null,null,null,null,null,null,null,null,null,null,null,4.9800000000000004,null,null,null,null,null,null,null,null,null,null,null,null,null,null,null,"Ehepartner_-_select","Ehepartner","-","select",0]
["Fresenius Versicherungsvermittlungs GmbH","yes",null,null,null,"E08","A, or 1","B, or 2","C, or 3","D, or 4",null,"E08","-",null,null,null,null,null,null,null,null,null,null,null,4.97,null,null,null,null,null,null,null,null,null,null,null,null,null,null,null,"Ehepartner_19 - 67 years_select","Ehepartner","19 - 67 years","select",22.97]
["Hyginus Publisher GmbH","yes",null,null,null,"E09","A, or 1","B, or 2","C, or 3","D, or 4",null,"E09","administrative","technical","foreman",null,null,null,null,null,null,null,null,null,4.96,null,"FreistellungMöglich_Befristet_AlterteilzeitPassivOderOhneEntgeltOderFreigestellt",null,null,null,null,null,null,null,null,null,null,null,null,null,"Ehepartner_from 68 years_select","Ehepartner","from 68 years","select",29.86]
["Fresenius HemoCare GmbH","yes",null,null,null,"E10","A, or 1","B, or 2","C, or 3","D, or 4",null,"E10","administrative","technical","foreman",null,null,null,null,null,null,null,null,null,4.95,null,"Ja_Ja_Nein","Days in lieu & Payment",null,null,null,null,null,null,null,null,null,null,null,null,"Kind_-_select","Kind","-","select",0]
["other Fresenius company","no",null,null,null,"E11","A, or 1","B, or 2","C, or 3","D, or 4",null,"E11","administrative","technical","foreman",null,null,null,null,null,null,null,null,null,4.9400000000000004,null,"Ja_Ja_Ja","Days in lieu & Payment",null,null,null,null,null,null,null,null,null,null,null,null,"Kind_0 - 18 years_select","Kind","0 - 18 years","select",8.84]
[null,null,null,null,null,"E12","A, or 1","B, or 2","C, or 3","D, or 4",null,"E12","administrative","technical","foreman",null,null,null,null,null,null,null,null,null,4.93,null,"Ja_Nein_Nein","Days in lieu & Compensatory time account","Days in lieu & PlusCard","Compensatory time account","Compensatory time account & PlusCard","PlusCard",null,null,null,null,null,null,null,null,"Kind_19 - 25 years_select","Kind","19 - 25 years","select",22.97]
[null,null,null,null,null,"E13","-",null,null,null,null,"E13","administrative","technical","foreman",null,null,null,null,null,null,null,null,null,4.92,null,"Ja_Nein_Ja","Days in lieu & PlusCard","PlusCard",null,null,null,null,null,null,null,null,null,null,null,"Ehepartner_-_premium","Ehepartner","-","premium",0]
[null,null,null,null,null,"Azubi","1st year","2nd year","3rd year","4th year",null,"Azubi","-",null,null,null,null,null,null,null,null,null,null,null,4.91,null,"Nein_Ja_Nein",null,null,null,null,null,null,null,null,null,null,null,null,null,"Ehepartner_19 - 67 years_premium","Ehepartner","19 - 67 years","premium",27.92]
[null,null,null,null,null,null,null,null,null,null,null,null,null,null,null,null,null,null,null,null,null,null,null,null,4.9000000000000004,null,"Nein_Ja_Ja",null,null,null,null,null,null,null,null,null,null,null,null,null,"Ehepartner_from 68 years_premium","Ehepartner","from 68 years","premium",36.299999999999997]
[null,null,null,null,null,null,null,null,null,null,null,null,null,null,null,null,null,null,null,null,null,null,null,null,4.8899999999999997,null,"Nein_Nein_Nein","Compensatory time account","Compensatory time account & PlusCard","PlusCard",null,null,null,null,null,null,null,null,null,null,"Kind_-_premium","Kind","-","premium",0]
["Entgelttabellen",null,null,null,null,null,null,null,null,null,null,null,null,null,null,null,null,null,null,null,null,null,null,null,4.88,null,"Nein_Nein_Ja","PlusCard",null,null,null,null,null,null,null,null,null,null,null,null,"Kind_0 - 18 years_premium","Kind","0 - 18 years","premium",10.74]
[{"$f":"CONCATENATE(B19,\"_\",C19,\"_\",D19,\"_\",E19,\"_\",F19)","v":"2022_other federal state_E01_-_-"},2022,"other federal state","E01","-","-",2730,null,null,null,null,null,null,null,null,null,null,null,null,null,null,null,null,null,4.87,null,null,null,null,null,null,null,null,null,null,null,null,null,null,null,"Kind_19 - 25 years_premium","Kind","19 - 25 years","premium",27.92]
[{"$f":"CONCATENATE(B20,\"_\",C20,\"_\",D20,\"_\",E20,\"_\",F20)","v":"2022_other federal state_E02_-_-"},2022,"other federal state","E02","-","-",2853,null,null,null,null,null,null,null,null,null,null,null,null,null,null,null,null,null,4.8600000000000003,null,null,null,null,null,null,null,null,null,null,null,null,null,null,null,"Ehepartner_-_prevent","Ehepartner","-","prevent",0]
[{"$f":"CONCATENATE(B21,\"_\",C21,\"_\",D21,\"_\",E21,\"_\",F21)","v":"2022_other federal state_E03_-_-"},2022,"other federal state","E03","-","-",2911,null,null,null,null,null,null,null,null,null,null,null,null,null,null,null,null,null,4.8499999999999996,null,null,null,null,null,null,null,null,null,null,null,null,null,null,null,"Ehepartner_19 - 67 years_prevent","Ehepartner","19 - 67 years","prevent",97.51]
["2022_other federal state_E04_-_-",2022,"other federal state","E04","-","-",2950,null,null,null,null,null,null,null,null,null,null,null,null,null,null,null,null,null,4.84,null,null,null,null,null,null,null,null,null,null,null,null,null,null,null,"Ehepartner_from 68 years_prevent","Ehepartner","from 68 years","prevent",126.76]
["2022_other federal state_E05_A, or 1_-",2022,"other federal state","E05","A, or 1","-",3035,null,null,null,null,null,null,null,null,null,null,null,null,null,null,null,null,null,4.83,null,null,null,null,null,null,null,null,null,null,null,null,null,null,null,"Kind_-_prevent","Kind","-","prevent",0]
["2022_other federal state_E05_B, or 2_-",2022,"other federal state","E05","B, or 2","-",3111,null,null,null,null,null,null,null,null,null,null,null,null,null,null,null,null,null,4.82,null,null,null,null,null,null,null,null,null,null,null,null,null,null,null,"Kind_0 - 18 years_prevent","Kind","0 - 18 years","prevent",37.51]
["2022_other federal state_E05_C, or 3_-",2022,"other federal state","E05","C, or 3","-",3187,null,null,null,null,null,null,null,null,null,null,null,null,null,null,null,null,null,4.8099999999999996,null,null,null,null,null,null,null,null,null,null,null,null,null,null,null,"Kind_19 - 25 years_prevent","Kind","19 - 25 years","prevent",97.51]
["2022_other federal state_E06_A, or 1_-",2022,"other federal state","E06","A, or 1","-",3113,null,null,null,null,null,null,null,null,null,null,null,null,null,null,null,null,null,4.8]
["2022_other federal state_E06_B, or 2_-",2022,"other federal state","E06","B, or 2","-",3300,null,null,null,null,null,null,null,null,null,null,null,null,null,null,null,null,null,4.79]
["2022_other federal state_E06_C, or 3_-",2022,"other federal state","E06","C, or 3","-",3455,null,null,null,null,null,null,null,null,null,null,null,null,null,null,null,null,null,4.78]
["2022_other federal state_E06_D, or 4_-",2022,"other federal state","E06","D, or 4","-",3611,null,null,null,null,null,null,null,null,null,null,null,null,null,null,null,null,null,4.7699999999999996]
["2022_other federal state_E07_A, or 1_-",2022,"other federal state","E07","A, or 1","-",3226,null,null,null,null,null,null,null,null,null,null,null,null,null,null,null,null,null,4.76]
{"$rows_left_out":472}
{"sheet":"Hilfsvariablen","index":2,"n_rows":42,"n_cols":6,"rows_kept":42,"cut":false,"hidden":true,"merged":[]}
["Entgeltschlüssel",{"$f":"CONCATENATE(\"2022\",\"_\",'Selection future payment'!B9,\"_\",'Selection future payment'!B6,\"_\",'Selection future payment'!B8,\"_\",'Selection future payment'!B7)","v":"2022_Bavaria_E01_-_-"}]
["Entgelt",{"$f":"VLOOKUP(B1,Entgelttabelle,7,FALSE)*'Selection future payment'!B10","v":2701}]
["Zukunftsbetraganspruch in Prozent vom Gehalt",0.23,null,"PlusCard","Tarif/alter","Kosten"]
["Zukunftsbetrag",{"$f":"IF(B15=\"\",\"0\",ROUND(B2*B3,2))","v":"0"},null,"Tarif",{"$f":"'Selection future payment'!B23","v":"select"},{"$f":"VLOOKUP(Hilfsvariablen!E4,Datenbasis1!AC2:AD4,2,FALSE)","v":12.67}]
["max. Tage Freistellung",{"$f":"ROUNDDOWN(3/5*'Selection future payment'!B11,0)","v":3},null,"FamilienTarif",{"$f":"'Selection future payment'!B25","v":"comfort"},"-"]
["Wert 1 Tage Freitstellung",{"$f":"ROUND(B4/'Selection future payment'!B11,2)","v":0},null,"Ehepartner",{"$f":"'Selection future payment'!B26","v":"-"},{"$f":"IF('Selection future payment'!B24=\"yes\",VLOOKUP(\"Ehepartner_\"&E6&\"_\"&E$5,PlusCardTariftabelleFamilie,5,FALSE),0)","v":0}]
["Gewählte Tage Freistellung",{"$f":"VLOOKUP('Selection future payment'!B30,Datenbasis1!AU2:AV4,2,FALSE)","v":1},null,"Kind1",{"$f":"'Selection future payment'!B27","v":"-"},{"$f":"IF('Selection future payment'!B24=\"yes\",VLOOKUP(\"Kind_\"&E7&\"_\"&E$5,PlusCardTariftabelleFamilie,5,FALSE),0)","v":0}]
["Betrag Freistellung",{"$f":"IF(B5>0,ROUND((B6*B7),2),0)","v":0},null,"Kind2",{"$f":"'Selection future payment'!B28","v":"-"},{"$f":"IF('Selection future payment'!B24=\"yes\",VLOOKUP(\"Kind_\"&E8&\"_\"&E$5,PlusCardTariftabelleFamilie,5,FALSE),0)","v":0}]
["PassenderTarifvertrag",{"$f":"VLOOKUP('Selection future payment'!$B$3,GesellschaftTarifvertrag,2,FALSE)","v":{"$error":"#N/A"}},null,"Kind3",{"$f":"'Selection future payment'!B29","v":"-"},{"$f":"IF('Selection future payment'!B24=\"yes\",VLOOKUP(\"Kind_\"&E9&\"_\"&E$5,PlusCardTariftabelleFamilie,5,FALSE),0)","v":0}]
["Eintrittsdatum vor 03.01.",{"$f":"'Selection future payment'!B4","v":"yes"},null,"Summe",null,{"$f":"SUM(F4:F9)","v":12.67}]
["Langzeitkonto möglich",{"$f":"IF(OR($B$9=\"no\",$B$10=\"no\",'Selection future payment'!$B$5<>\"tariff-employee\",'Selection future payment'!$B$12=\"fixed-term contract\",'Selection future payment'!$B$14=\"yes\",'Selection future payment'!$B$15=\"retirement period\",'Selection future payment'!$B$15=\"working period\",'Selection future payment'!$B$16=\"yes\"),\"Nein\",\"Ja\")","v":{"$error":"#N/A"}}]
["Freistellung möglich",{"$f":"IF(OR($B$9=\"no\",$B$10=\"no\",'Selection future payment'!$B$5<>\"tariff-employee\",'Selection future payment'!$B$14=\"yes\",'Selection future payment'!$B$15=\"retirement period\",'Selection future payment'!$B$16=\"yes\",B5<1),\"Nein\",\"Ja\")","v":{"$error":"#N/A"}}]
["PlusCard möglich",{"$f":"IF(OR($B$9=\"no\",$B$10=\"no\",'Selection future payment'!$B$5<>\"tariff-employee\",'Selection future payment'!$B$12=\"fixed-term contract\",'Selection future payment'!$B$14=\"yes\",'Selection future payment'!$B$15=\"retirement period\",'Selection future payment'!$B$16=\"yes\"),\"Nein\",\"Ja\")","v":{"$error":"#N/A"}}]
["Auszahlung möglich",{"$f":"IF(OR($B$9=\"no\",$B$10=\"no\",AND('Selection future payment'!$B$5<>\"tariff-employee\",'Selection future payment'!$B$5=\"apprentice\",'Selection future payment'!$B$5=\"dual student\"),'Selection future payment'!$B$14=\"yes\",'Selection future payment'!$B$15=\"retirement period\",'Selection future payment'!$B$16=\"yes\"),\"Nein\",\"Ja\")","v":{"$error":"#N/A"}}]
["Verwendungsmöglichkeiten 2022",{"$f":"IF(ISERROR(_xlfn.TEXTJOIN(\", \",TRUE,IF(B11=\"Ja\",\"Langzeitkonto\",\"\"),IF(B12=\"Ja\",\"Individuelle Freistellungstage\",\"\"),IF(B13=\"Ja\",\"Pluscard\",\"\"))),\"\",_xlfn.TEXTJOIN(\", \",TRUE,IF(B11=\"Ja\",\"Langzeitkonto\",\"\"),IF(B12=\"Ja\",\"Individuelle Freistellungstage\",\"\"),IF(B13=\"Ja\",\"Pluscard\",\"\")))","v":""}]
["Ergebnis Zukunftsbetrag 2022",{"$f":"IF('Selection future payment'!B3=\"\",\"Please select a company and then fill out the form from top to bottom!\",IF(OR(ISERROR(Hilfsvariablen!B2),ISERROR(Hilfsvariablen!B4),ISERROR(Hilfsvariablen!B15)),\"Please check your entries! \nPlease be sure to make your entries in top-to-bottom order.\",CONCATENATE(IF(Hilfsvariablen!B15=\"\",IF(AND(B14=\"Ja\",OR('Selection future payment'!$B$5=\"apprentice\",'Selection future payment'!$B$5=\"dual student\")),\"Based on your entries you can use your tariff-based future payment 2022 for the following options:\n\nPayment according to special regulation in the collective agreement.\",\"Based on your entries you have no entitlement to the tariff-based future payment 2022!\"),CONCATENATE(IF('Selection future payment'!$B$5<>\"non-tariff employee\",CONCATENATE(\"Based on your entries your tariff-based future payment 2022 amounts to\n\",TEXT(Hilfsvariablen!B4,\"0,00\"),\" € (gross).\",\"\n\n\"),\"\"),\"Prerequisite for an entitlement as of 03.01.2022 is that the employement relationship has not been terminated.\")))))","v":"Please select a company and then fill out the form from top to bottom!"}]
["Hilfsergebnis",{"$f":"IF(OR(B16=\"Based on your entries you have no entitlement to the tariff-based future payment 2022!\",B16=\"Please select a company and then fill out the form from top to bottom!\",B16=\"Please check your entries! \nPlease be sure to make your entries in top-to-bottom order.\"),\"Kein Zukunftsbetrag\",IF(NOT(ISERROR(FIND(\"special regulation\",B16,1))),\"Payment according to special regulation in the collective agreement.\",\"\"))","v":"Kein Zukunftsbetrag"}]
[]
["Hinweistext","- To simplify editing, a macro is necessary, click in the dialog <activate macros> or click in the yellow menu bar <activate content>\n\n- The form is to be filled out from top to bottom, because some choices depend on each other\n\n- If you change an entry afterwards, all the following selection options must be checked again for valid values"]
[null,null,"Restbetrag","PlusCard*12","Freistellung"]
["Ergebnis Freistellung & Langzeitkonto",{"$f":"IF(C21<0,\"The intended uses you have selected exceed the amount of your tariff-based future payment.\nPlease make another selection.\",CONCATENATE(\"You choose \",'Selection future payment'!B30,\". \nThe remaining amount in the amount of \",TEXT(C21,\"0,00\"),\" € (gross) will be paid into the compensatory time account with the April 2022 payroll.\"))","v":"You choose 1 day in lieu. \nThe remaining amount in the amount of 0,00 € (gross) will be paid into the compensatory time account with the April 2022 payroll."},{"$f":"B$4-D21-E21","v":0},null,{"$f":"B$8","v":0}]
["Ergebnis Freistellung & PlusCard",{"$f":"IF(C22<0,CONCATENATE(\"The intended uses you have selected exceed the amount of your tariff-based future payment.\nThe outstanding remaining amount of \",TEXT(ROUNDDOWN(C22/12*-1,2),\"0,00\"),\" € monthly will be deducted from your net salary.\"),CONCATENATE(\"You choose \",'Selection future payment'!B30,\". \nIn addition, an amount of \",TEXT(D22,\"0,00\"),\" € will be used for the PlusCard. \nThe remaining amount in the amount of \",TEXT(C22,\"0,00\"),\" € will be paid to you with your payroll.\"))","v":"The intended uses you have selected exceed the amount of your tariff-based future payment.\nThe outstanding remaining amount of 12,67 € monthly will be deducted from your net salary."},{"$f":"B$4-D22-E22","v":-152.04},{"$f":"F$10*12","v":152.04},{"$f":"B$8","v":0}]
["Ergebnis Langzeitkonto",{"$f":"IF(C23<0,\"The intended uses you have selected exceed the amount of your tariff-based future payment.\nPlease make another selection.\",CONCATENATE(\"Your tariff-based future payment 2022 in the amount of \",TEXT(C23,\"0,00\"),\" € (gross) \nwill be transferred to the compensatory time account with the April 2022 payroll.\"))","v":"Your tariff-based future payment 2022 in the amount of 0,00 € (gross) \nwill be transferred to the compensatory time account with the April 2022 payroll."},0]
["Ergebnis Langzeitkonto & PlusCard",{"$f":"IF(C24<0,CONCATENATE(\"The intended uses you have selected exceed the amount of your tariff-based future payment.\nThe outstanding remaining amount of \",TEXT(ROUNDDOWN(C24/12*-1,2),\"0,00\"),\" € monthly will be deducted from your net salary.\"),CONCATENATE(\"Your tariff-based future payment 2022 will be used in the amount of \",TEXT(D24,\"0,00\"),\" € for the PlusCard. \nThe remaining amount in the amount of \",TEXT(C24,\"0,00\"),\" € will be paid into the compensatory time account with the April 2022 payroll.\"))","v":"The intended uses you have selected exceed the amount of your tariff-based future payment.\nThe outstanding remaining amount of 12,67 € monthly will be deducted from your net salary."},-152.04,{"$f":"F$10*12","v":152.04}]
["Ergebnis PlusCard",{"$f":"IF(C25<0,CONCATENATE(\"The intended uses you have selected exceed the amount of your tariff-based future payment.\nThe outstanding remaining amount of \",TEXT(ROUNDDOWN(C25/12*-1,2),\"0,00\"),\" € monthly will be deducted from your net salary.\"),CONCATENATE(\"Your tariff-based future payment 2022 will be used in the amount of \",TEXT(D25,\"0,00\"),\" € for the PlusCard.  \nThe remaining amount in the amount of \",TEXT(C25,\"0,00\"),\" € will be paid to you with your payroll.\"))","v":"The intended uses you have selected exceed the amount of your tariff-based future payment.\nThe outstanding remaining amount of 12,67 € monthly will be deducted from your net salary."},-152.04,{"$f":"F$10*12","v":152.04}]
["Ergebnis Freistellung & Auszahlung",{"$f":"IF(C26<0,\"The intended uses you have selected exceed the amount of your tariff-based future payment.\nPlease make another selection.\",CONCATENATE(\"You choose \",'Selection future payment'!B30,\". \nThe remaining amount in the amount of \",TEXT(C26,\"0,00\"),\" € (gross) will be paid to you with your April 2022 payroll.\"))","v":"You choose 1 day in lieu. \nThe remaining amount in the amount of 0,00 € (gross) will be paid to you with your April 2022 payroll."},0,null,0]
["Ergebnis der gewählten Verwendungsmöglichkeit 2022",{"$f":"IF('Selection future payment'!B3=\"\",\"Please select a company and then fill out the form from top to bottom!\",IF(B17=\"Kein Zukunftsbetrag\",\"Based on your entries, you do not have any available usage options for the future amount 2022!\",IF(B17=\"Payment according to special regulation in the collective agreement.\",\"Payment according to special regulation in the collective agreement.\",IF(OR(AND('Selection future payment'!B12=\"permanemt contract\",'Selection future payment'!B22=\"Days in lieu & Payment\"),AND('Selection future payment'!B12=\"fixed-term contract\",'Selection future payment'!B22<>\"Days in lieu & Payment\"),AND('Selection future payment'!B24=\"yes\",'Selection future payment'!B26=\"-\",'Selection future payment'!B27=\"-\"),AND(B5=0,OR('Selection future payment'!B22=\"Days in lieu & Compensatory time account\",'Selection future payment'!B22=\"Days in lieu & PlusCard\"))),\"Please check your entries! \nPlease be sure to make your entries in top-to-bottom order.\",IF('Selection future payment'!B22=\"Days in lieu & Compensatory time account\",Hilfsvariablen!B21,IF('Selection future payment'!B22=\"Days in lieu & PlusCard\",Hilfsvariablen!B22,IF('Selection future payment'!B22=\"Compensatory time account\",Hilfsvariablen!B23,IF('Selection future payment'!B22=\"Compensatory time account & PlusCard\",Hilfsvariablen!B24,IF('Selection future payment'!B22=\"PlusCard\",Hilfsvariablen!B25,IF('Selection future payment'!B22=\"Days in lieu & Payment\",Hilfsvariablen!B26,\"Please select a valid usage option!\"))))))))))","v":"Please select a company and then fill out the form from top to bottom!"}]
[]
[]
["Befristet",{"$f":"IF('Selection future payment'!$B$12=\"fixed-term contract\",\"Ja\",\"Nein\")","v":"Nein"}]
{"$rows_left_out":12}